{"text_format":"1","workbook":"xlsx","n_sheets":11,"sheets":["Info","Table Of Contents","Instruction","Input and Output >","Radial","Radial with IC","Mesh","Model Formulation >","Radial formulation","Radial IC formulation","Mesh formulation"],"not_rendered":{"charts":0,"images":10,"macros":1,"external_links":0,"defined_names":570,"comments":2,"pivot_tables":0},"unopened":[],"bounds":{"document_bytes":16777216,"sheet_cells":100000,"rows_first":2000,"rows_last":500,"rows_between":2000,"halvings":0,"cell_chars":16384,"cell_head_chars":4096},"cells_cut":0,"cells_raw":0,"read":"whole","date_system":"1900"}

{"sheet":"Info","index":0,"n_rows":26,"n_cols":3,"rows_kept":26,"cut":false,"hidden":false,"merged":[[24,0,24,1],[25,0,25,1],[20,2,20,3],[20,0,20,1],[21,0,21,1],[22,0,22,1],[23,0,23,1]]}
[]
[]
[]
[]
[]
[]
[]
[]
[]
[]
[]
[]
[]
[]
[]
[]
[]
[]
[]
[]
["Creation Date",null,"2024-07-16"]
["Client",null,"Australian Energy Market Commission"]
["Project",null,"Transmission Access Reform Stylised Model"]
["Description"]
["Author",null,"Endgame Economics"]
["Version",null,1]

{"sheet":"Table Of Contents","index":1,"n_rows":13,"n_cols":3,"rows_kept":13,"cut":false,"hidden":false,"merged":[]}
[null,"ENDGAME Economics | AEMC transmission access reform | Stylised model"]
[null,"Table Of Contents"]
[]
[null,"Sheet","Description"]
[null,"Instruction","Instruction on setup and executing runs"]
[null,"Input and Output >"]
[null,"Radial","Radial network input and output"]
[null,"Radial with IC","Radial with IC network input and output"]
[null,"Mesh","Mesh network input and output"]
[null,"Model Formulation >"]
[null,"Radial formulation","Radial network formulation"]
[null,"Radial IC formulation","Radial with IC network formulation"]
[null,"Mesh formulation","Mesh network formulation"]

{"sheet":"Instruction","index":2,"n_rows":35,"n_cols":2,"rows_kept":35,"cut":false,"hidden":false,"merged":[]}
[null,"ENDGAME Economics | AEMC transmission access reform | Stylised model"]
[null,"instruction"]
[]
[null,"Setup"]
[]
[null,"To enable Solver Add-in"]
[]
[]
[]
[]
[]
[]
[]
[]
[]
[]
[]
[]
[]
[]
[]
[]
[]
[]
[]
[]
[]
[]
[]
[]
[]
[]
[]
[]
[null,"Executing simulation"]

{"sheet":"Input and Output >","index":3,"n_rows":0,"n_cols":0,"rows_kept":0,"cut":false,"hidden":false,"merged":[]}

{"sheet":"Radial","index":4,"n_rows":107,"n_cols":18,"rows_kept":107,"cut":false,"hidden":false,"merged":[[22,3,22,6],[22,12,22,15]]}
[null,"ENDGAME Economics | AEMC transmission access reform | Stylised model"]
[null,"Output ( 1 hour resolution)"]
[]
[null,"Global settings"]
[]
[null,"Priority level","BPF ($/MWh)",null,null,null,null,null,null,null,null,"Colour guide"]
[null,1,-1000,null,null,null,null,null,null,null,null,null,"User inputs"]
[null,2,-850,null,null,null,null,null,null,null,null,null,"Model output - do not change"]
[null,3,-700,null,null,null,null,null,null,null,null,null,"Derived calculation - do not change"]
[null,4,-550,null,null,null,null,null,null,null,null,null,"Fixed parameter - do not change"]
[]
[null,"General assumptions","$/MWh"]
[null,"VOLL",17500]
[]
[]
[null,"User inputs"]
[]
[null,"Scenario 1",null,null,null,null,null,null,null,null,"Scenario 2"]
[]
[null,"Demand (RRN)","MW",null,null,null,null,null,null,null,"Demand (RRN)","MW"]
[null,1,250,null,null,null,null,null,null,null,1,250]
[]
[null,null,"RHS","LHS",null,null,null,null,null,null,null,"RHS","LHS"]
[null,"Transfer Cosntraint","Rating (MW)","Unit 1","Unit 2","Unit 3","Unit 4",null,null,null,"Transfer Cosntraint","Rating (MW)","Unit 1","Unit 2","Unit 3","Unit 4"]
[null,1,120,null,1,0.8,0.6,null,null,null,1,100,null,1,1,1]
[]
[null,"Unit Specification","Capacity (MW)","SRMC ($/MWh)","Is load","CRM participation","CRM Strategic bid",null,null,null,"Unit Specification","Capacity (MW)","SRMC ($/MWh)","Is load","CRM participation","CRM Strategic bid"]
[null,1,300,80,false,true,80,null,null,null,1,200,50,false,true,100]
[null,2,100,25,false,true,25,null,null,null,2,100,0,false,true,30]
[null,3,100,15,false,true,20,null,null,null,3,100,10,false,true,50]
[null,4,100,12,false,true,12,null,null,null,4,50,0,true,true,15]
[]
[null,"Unit Bidding","Priority level","Access run bidding strategy","CRM bidding strategy","Access run bid ($/MWh)","CRM bid ($/MWh)",null,null,null,"Unit Bidding","Priority level","Access run bidding strategy","CRM bidding strategy","Access run bid ($/MWh)","CRM bid ($/MWh)"]
[null,1,1,"SRMC","SRMC",{"$f":"IF(D34 = \"BPF\",VLOOKUP(C34,$B$7:$C$10,2,FALSE),D28)","v":80},{"$f":"IF(E34 = \"SRMC\",D28,G28)","v":80},null,null,null,1,1,"SRMC","SRMC",{"$f":"IF(M34 = \"BPF\",VLOOKUP(L34,$B$7:$C$10,2,FALSE),M28)","v":50},{"$f":"IF(N34 = \"SRMC\",M28,P28)","v":50}]
[null,2,1,"BPF","SRMC",{"$f":"IF(D35 = \"BPF\",VLOOKUP(C35,$B$7:$C$10,2,FALSE),D29)","v":-1000},{"$f":"IF(E35 = \"SRMC\",D29,G29)","v":25},null,null,null,2,1,"SRMC","SRMC",{"$f":"IF(M35 = \"BPF\",VLOOKUP(L35,$B$7:$C$10,2,FALSE),M29)","v":0},{"$f":"IF(N35 = \"SRMC\",M29,P29)","v":0}]
[null,3,3,"BPF","Strategic",{"$f":"IF(D36 = \"BPF\",VLOOKUP(C36,$B$7:$C$10,2,FALSE),D30)","v":-700},{"$f":"IF(E36 = \"SRMC\",D30,G30)","v":20},null,null,null,3,1,"SRMC","SRMC",{"$f":"IF(M36 = \"BPF\",VLOOKUP(L36,$B$7:$C$10,2,FALSE),M30)","v":10},{"$f":"IF(N36 = \"SRMC\",M30,P30)","v":10}]
[null,4,4,"BPF","SRMC",{"$f":"IF(D37 = \"BPF\",VLOOKUP(C37,$B$7:$C$10,2,FALSE),D31)","v":-550},{"$f":"IF(E37 = \"SRMC\",D31,G31)","v":12},null,null,null,4,1,"BPF","Strategic",{"$f":"IF(M37 = \"BPF\",VLOOKUP(L37,$B$7:$C$10,2,FALSE),M31)","v":-1000},{"$f":"IF(N37 = \"SRMC\",M31,P31)","v":15}]
[]
[null,"Unit Contracts","Type","Volume (MW/hr)","Strike price ($/MW/hr)",null,null,null,null,null,"Unit Contracts","Type","Volume (MW/hr)","Strike price ($/MW/hr)"]
[null,1,"Cap",50,300,null,null,null,null,null,1,"Cap",50,90]
{"$rows_left_out":68}
{"sheet":"Radial with IC","index":5,"n_rows":134,"n_cols":18,"rows_kept":134,"cut":false,"hidden":false,"merged":[[28,3,28,8],[28,12,28,17]]}
[null,"ENDGAME Economics | AEMC transmission access reform | Stylised model"]
[null,"Output ( 1 hour resolution)"]
[]
[null,"Global settings"]
[]
[null,"Priority level","BPF ($/MWh)",null,null,null,null,null,null,null,null,"Colour guide"]
[null,1,-1000,null,null,null,null,null,null,null,null,null,"User inputs"]
[null,2,-850,null,null,null,null,null,null,null,null,null,"Model output - do not change"]
[null,3,-700,null,null,null,null,null,null,null,null,null,"Derived calculation - do not change"]
[null,4,-550,null,null,null,null,null,null,null,null,null,"Fixed parameter - do not change"]
[null,5,-400]
[null,6,-250]
[]
[null,"General assumptions","$/MWh"]
[null,"VOLL",17500]
[]
[]
[null,"User inputs"]
[]
[null,"Scenario 1",null,null,null,null,null,null,null,null,"Scenario 2"]
[]
[null,"Demand (RRN)","MW",null,null,null,null,null,null,null,"Demand (RRN)","MW"]
[null,1,500,null,null,null,null,null,null,null,1,200]
[null,2,300,null,null,null,null,null,null,null,2,213]
[]
[null,"Line","Rating (MW)",null,null,null,null,null,null,null,"Line","Rating (MW)"]
[null,1,90,null,null,null,null,null,null,null,1,300]
[]
[null,null,"RHS","LHS",null,null,null,null,null,null,null,"RHS","LHS"]
[null,"Transfer Cosntraint","Rating (MW)","Unit 1","Unit 2","Unit 3","Unit 4","Unit 5","Unit 6",null,"Transfer Cosntraint","Rating (MW)","Unit 1","Unit 2","Unit 3","Unit 4","Unit 5","Unit 6"]
[null,1,130,null,1,0.5,null,null,null,null,1,100,null,1,0.5]
[null,2,100,null,null,null,null,1,0.5,null,2,150,null,null,null,null,1,0.2]
[]
[null,"Unit Specification","Capacity (MW)","SRMC ($/MWh)","Is load","CRM participation","CRM Strategic bid",null,null,null,"Unit Specification","Capacity (MW)","SRMC ($/MWh)","Is load","CRM participation","CRM Strategic bid"]
[null,1,400,80,false,true,100,null,null,null,1,400,80,false,false,0]
[null,2,100,30,false,true,45,null,null,null,2,100,30,false,false,0]
[null,3,100,20,false,true,50,null,null,null,3,100,0,false,false,0]
[null,4,400,150,false,true,200,null,null,null,4,400,150,false,false,0]
[null,5,100,10,false,true,50,null,null,null,5,100,10,false,false,0]
[null,6,100,0,false,true,30,null,null,null,6,100,0,false,true,0]
{"$rows_left_out":95}
{"sheet":"Mesh","index":6,"n_rows":147,"n_cols":18,"rows_kept":147,"cut":false,"hidden":false,"merged":[[29,12,29,17]]}
[null,"ENDGAME Economics | AEMC transmission access reform | Stylised model"]
[null,"Output ( 1 hour resolution)"]
[]
[null,"Global settings"]
[]
[null,"Priority level","BPF ($/MWh)",null,null,null,null,null,null,null,null,"Colour guide"]
[null,1,-1000,null,null,null,null,null,null,null,null,null,"User inputs"]
[null,2,-850,null,null,null,null,null,null,null,null,null,"Model output - do not change"]
[null,3,-700,null,null,null,null,null,null,null,null,null,"Derived calculation - do not change"]
[null,4,-550,null,null,null,null,null,null,null,null,null,"Fixed parameter - do not change"]
[null,5,-400]
[null,6,-250]
[]
[null,"General assumptions","$/MWh"]
[null,"VOLL",17500]
[]
[]
[null,"User inputs"]
[]
[null,"Scenario 1",null,null,null,null,null,null,null,null,"Scenario 2"]
[]
[null,"Demand (node)","MW",null,null,null,null,null,null,null,"Demand (node)","MW"]
[null,1,50,null,null,null,null,null,null,null,1,50]
[null,2,150,null,null,null,null,null,null,null,2,150]
[null,3,50,null,null,null,null,null,null,null,3,50]
[null,4,400,null,null,null,null,null,null,null,4,400]
[null,5,50,null,null,null,null,null,null,null,5,50]
[null,6,150,null,null,null,null,null,null,null,6,150]
[]
[]
[null,"Line ","Rating (MW)",null,null,null,null,null,null,null,"Line ","Rating (MW)"]
[null,1,200,null,null,null,null,null,null,null,1,200]
[null,2,200,null,null,null,null,null,null,null,2,200]
[null,3,250,null,null,null,null,null,null,null,3,200]
[null,4,100,null,null,null,null,null,null,null,4,100]
[null,5,200,null,null,null,null,null,null,null,5,200]
[null,6,200,null,null,null,null,null,null,null,6,200]
[]
[null,"Unit Specification","Capacity (MW)","SRMC ($/MWh)","Is load","CRM participation","CRM Strategic bid",null,null,null,"Unit Specification","Capacity (MW)","SRMC ($/MWh)","Is load","CRM participation","CRM Strategic bid"]
[null,1,200,60,false,false,0,null,null,null,1,200,60,false,false,0]
{"$rows_left_out":108}
{"sheet":"Model Formulation >","index":7,"n_rows":0,"n_cols":0,"rows_kept":0,"cut":false,"hidden":false,"merged":[]}

{"sheet":"Radial formulation","index":8,"n_rows":79,"n_cols":22,"rows_kept":79,"cut":false,"hidden":false,"merged":[[10,2,10,5],[27,2,27,6],[35,2,35,6],[10,13,10,16],[35,13,35,17],[27,13,27,17],[47,13,47,16],[73,13,73,17],[65,13,65,17],[47,2,47,5],[73,2,73,6],[65,2,65,6]]}
[null,"ENDGAME Economics | AEMC transmission access reform | Stylised model"]
[null,"Model formulation - Radial"]
[null,"DO NOT MODIFY"]
[null,"Access Run"]
[]
[null,"Scenario 1",null,null,null,null,null,null,null,null,null,null,"Scenario 2"]
[]
[]
[]
[]
[null,null,"Dispatch",null,null,null,"USE",null,null,null,null,null,null,"Dispatch",null,null,null,"USE"]
[null,"Variable specification","Unit 1","Unit 2","Unit 3","Unit 4","USE Node 1",null,null,null,null,null,"Variable specification","Unit 1","Unit 2","Unit 3","Unit 4","USE Node 1"]
[null,"Cost coefficient",{"$f":"TRANSPOSE(Radial!$F$34:$F$37) *IF(_xlfn.ANCHORARRAY(C14),-1,1)","v":80},-1000,-700,-550,17500,null,null,null,null,null,"Cost coeffeiceint",{"$f":"TRANSPOSE(Radial!$O$34:$O$37) *IF(_xlfn.ANCHORARRAY(N14),-1,1)","v":50},0,10,1000,17500]
[null,"Is load",{"$f":"TRANSPOSE(Radial!$E$28:$E$31)","v":false},false,false,false,null,null,null,null,null,null,"Is load",{"$f":"TRANSPOSE(Radial!$N$28:$N$31)","v":false},false,false,true]
[null,"Lowerbound",0,0,0,0,0,null,null,null,null,null,"Lowerbound",0,0,0,0,0]
[null,"Solution",116.66666666666666,100,0,33.333333333333343,0,null,null,null,null,null,"Solution",150,100,0,0,0]
[null,"Upperbound",{"$f":"TRANSPOSE(Radial!$C$28:$C$31)","v":300},100,100,100,{"$f":"TRANSPOSE(Radial!$C$21:$C$21)","v":250},null,null,null,null,null,"Upperbound",{"$f":"TRANSPOSE(Radial!$L$28:$L$31)","v":200},100,100,50,{"$f":"TRANSPOSE(Radial!$L$21:$L$21)","v":250}]
[]
[]
[null,"Sense","Minimisation",null,null,null,null,null,null,null,null,null,"Sense","Minimisation"]
[]
[null,"Objective value",{"$f":"SUMPRODUCT(C13:G13,C16:G16)","v":-109000.00000000001},null,null,null,null,null,null,null,null,null,"Objective value",{"$f":"SUMPRODUCT(N13:R13,N16:R16)","v":7500}]
[]
[]
[null,"Supply demand balance constraints",null,null,null,null,null,null,null,null,null,null,"Supply demand balance constraints"]
[null,"Enforce dispatch to meet demand",null,null,null,null,null,null,null,null,null,null,"Enforce dispatch to meet demand"]
[]
[null,null,"LHS Coefficient",null,null,null,null,null,null,null,null,null,null,"LHS Coefficient"]
[null,"Constraint index","Unit 1","Unit 2","Unit 3","Unit 4","USE Node 1","LHS","Sense","RHS","Dual",null,"Constraint index","Unit 1","Unit 2","Unit 3","Unit 4","USE Node 1","LHS","Sense","RHS","Dual"]
[null,"Node 1",{"$f":"IF(C$14,-1,1)","v":1},{"$f":"IF(D$14,-1,1)","v":1},1,1,1,{"$f":"SUMPRODUCT(C$16:G$16,C30:G30)","v":250},"=",{"$f":"Radial!C21","v":250},80,null,"Node 1",{"$f":"IF(N$14,-1,1)","v":1},{"$f":"IF(O$14,-1,1)","v":1},1,-1,1,{"$f":"SUMPRODUCT(N$16:R$16,N30:R30)","v":250},"=",{"$f":"Radial!L21","v":250},50]
[]
[]
[null,"Nodal dispatch constraints",null,null,null,null,null,null,null,null,null,null,"Nodal dispatch constraints"]
[null,"Constraint dispatch based on flow limit",null,null,null,null,null,null,null,null,null,null,"Constraint dispatch based on flow limit"]
[]
[null,null,"LHS Coefficient",null,null,null,null,null,null,null,null,null,null,"LHS Coefficient"]
[null,"Constraint index","Unit 1","Unit 2","Unit 3","Unit 4","USE Node 1","LHS","Sense","RHS","Dual",null,"Constraint index","Unit 1","Unit 2","Unit 3","Unit 4","USE Node 1","LHS","Sense","RHS","Dual"]
[null,"Transfer limit",null,{"$f":"IF(D$14,-1,1) * Radial!E25","v":1},{"$f":"IF(E$14,-1,1) * Radial!F25","v":0.8},{"$f":"IF(F$14,-1,1) * Radial!G25","v":0.6},null,{"$f":"SUMPRODUCT(C$16:G$16,C38:G38)","v":120},"<=",{"$f":"Radial!C25","v":120},-1050.0000000000005,null,"Transfer limit",null,{"$f":"IF(O$14,-1,1) *Radial!N25","v":1},{"$f":"IF(P$14,-1,1) *Radial!O25","v":1},{"$f":"IF(Q$14,-1,1) *Radial!P25","v":-1},null,{"$f":"SUMPRODUCT(N$16:R$16,N38:R38)","v":100},"<=",{"$f":"Radial!L25","v":100},-40]
[]
[]
{"$rows_left_out":40}
{"sheet":"Radial IC formulation","index":9,"n_rows":662,"n_cols":30,"rows_kept":662,"cut":false,"hidden":false,"merged":[[76,17,76,25],[67,17,67,25],[67,2,67,10],[76,2,76,10],[49,2,49,7],[49,9,49,10],[10,24,10,25],[36,17,36,25],[27,17,27,25],[49,17,49,22],[49,24,49,25],[10,9,10,10],[27,2,27,10],[36,2,36,10],[10,2,10,7],[10,17,10,22]]}
[null,"ENDGAME Economics | AEMC transmission access reform | Stylised model"]
[null,"Model formulation - Radial with IC"]
[null,"DO NOT MODIFY"]
[null,"Access Run"]
[]
[null,"Scenario 1",null,null,null,null,null,null,null,null,null,null,null,null,null,null,"Scenario 2"]
[]
[]
[]
[]
[null,null,"Dispatch",null,null,null,null,null,"Export","USE",null,null,null,null,null,null,null,"Dispatch",null,null,null,null,null,"Export","USE"]
[null,"Variable specification","Unit 1","Unit 2","Unit 3","Unit 4","Unit 5","Unit 6","Line 1","USE Node 1","USE Node 2",null,null,null,null,null,"Variable specification","Unit 1","Unit 2","Unit 3","Unit 4","Unit 5","Unit 6","Line 3","USE Node 1","USE Node 2"]
[null,"Cost coefficient",{"$f":"TRANSPOSE('Radial with IC'!$F43:$F48) * IF(_xlfn.ANCHORARRAY(C14),-1,1)","v":80},-550,-1000,150,-1000,-400,null,17500,17500,null,null,null,null,null,"Cost coeffeiceint",{"$f":"TRANSPOSE('Radial with IC'!$O$43:$O$48) * IF(_xlfn.ANCHORARRAY(R14),-1,1)","v":80},30,0,150,-1000,0,null,17500,17500]
[null,"Is load",{"$f":"TRANSPOSE('Radial with IC'!$E$35:$E$40)","v":false},false,false,false,false,false,null,null,null,null,null,null,null,null,"Is load",{"$f":"TRANSPOSE('Radial with IC'!$N$35:$N$40)","v":false},false,false,false,false,false]
[null,"Lowerbound",0,0,0,0,0,0,{"$f":"-'Radial with IC'!$C$27","v":-90},0,0,null,null,null,null,null,"Lowerbound",0,0,0,0,0,0,{"$f":"-'Radial with IC'!$L$27","v":-300},0,0]
[null,"Solution",400,80,100,120,100,0,-80,0,0,null,null,null,null,null,"Solution",63,50,100,0,100,100,-13,0,0]
[null,"Upperbound",{"$f":" TRANSPOSE('Radial with IC'!$C$35:$C$40)","v":400},100,100,400,100,100,{"$f":"'Radial with IC'!$C$27","v":90},{"$f":"TRANSPOSE('Radial with IC'!$C$23:$C$24)","v":500},300,null,null,null,null,null,"Upperbound",{"$f":" TRANSPOSE('Radial with IC'!$L$35:$L$40)","v":400},100,100,400,100,100,{"$f":"'Radial with IC'!$L$27","v":300},{"$f":"TRANSPOSE('Radial with IC'!$L$23:$L$24)","v":200},213]
[]
[]
[null,"Sense","Minimisation",null,null,null,null,null,null,null,null,null,null,null,null,null,"Sense","Minimisation"]
[]
[null,"Objective value",{"$f":"SUMPRODUCT(C13:K13,C16:K16)","v":-194000},null,null,null,null,null,null,null,null,null,null,null,null,null,"Objective value",{"$f":"SUMPRODUCT(R13:Z13,R16:Z16)","v":-93460}]
[]
[]
[null,"Supply demand balance constraints",null,null,null,null,null,null,null,null,null,null,null,null,null,null,"Supply demand balance constraints"]
[null,"Enforce dispatch to meet demand",null,null,null,null,null,null,null,null,null,null,null,null,null,null,"Enforce dispatch to meet demand"]
[]
[null,null,"LHS Coefficient",null,null,null,null,null,null,null,null,null,null,null,null,null,null,"LHS Coefficient"]
[null,"Constraint index","Unit 1","Unit 2","Unit 3","Unit 4","Unit 5","Unit 6","Line 1","USE Node 1","USE Node 2","LHS","Sense","RHS","Dual",null,"Constraint index","Unit 1","Unit 2","Unit 3","Unit 4","Unit 5","Unit 6","Line 3","USE Node 1","USE Node 2","LHS","Sense","RHS","Dual"]
[null,"Node 1",{"$f":"IF(C$14,-1,1)","v":1},{"$f":"IF(D$14,-1,1)","v":1},1,null,null,null,1,1,null,{"$f":"SUMPRODUCT(C$16:K$16,C30:K30)","v":500},"=",{"$f":"'Radial with IC'!C23","v":500},150,null,"Node 1",{"$f":"IF(R$14,-1,1)","v":1},{"$f":"IF(S$14,-1,1)","v":1},1,null,null,null,1,1,null,{"$f":"SUMPRODUCT(R$16:Z$16,R30:Z30)","v":200},"=",{"$f":"'Radial with IC'!L23","v":200},80]
[null,"Node 2",null,null,null,{"$f":"IF(F$14,-1,1)","v":1},{"$f":"IF(G$14,-1,1)","v":1},1,-1,null,1,{"$f":"SUMPRODUCT(C$16:K$16,C31:K31)","v":300},"=",{"$f":"'Radial with IC'!C24","v":300},150,null,"Node 2",null,null,null,{"$f":"IF(U$14,-1,1)","v":1},{"$f":"IF(V$14,-1,1)","v":1},1,-1,null,1,{"$f":"SUMPRODUCT(R$16:Z$16,R31:Z31)","v":213},"=",{"$f":"'Radial with IC'!L24","v":213},80]
[]
[]
[null,"Nodal dispatch constraints",null,null,null,null,null,null,null,null,null,null,null,null,null,null,"Nodal dispatch constraints"]
[null,"Constraint dispatch based on flow limit",null,null,null,null,null,null,null,null,null,null,null,null,null,null,"Constraint dispatch based on flow limit"]
[]
[null,null,"LHS Coefficient",null,null,null,null,null,null,null,null,null,null,null,null,null,null,"LHS Coefficient"]
[null,"Constraint index","Unit 1","Unit 2","Unit 3","Unit 4","Unit 5","Unit 6","Line 3","USE Node 1","USE Node 2","LHS","Sense","RHS","Dual",null,"Constraint index","Unit 1","Unit 2","Unit 3","Unit 4","Unit 5","Unit 6","Line 3","USE Node 1","USE Node 2","LHS","Sense","RHS","Dual"]
[null,"Transfer limit 1",null,{"$f":"IF(D$14,-1,1) * 'Radial with IC'!E31","v":1},{"$f":"IF(E$14,-1,1) * 'Radial with IC'!F31","v":0.5},null,null,null,null,null,null,{"$f":"SUMPRODUCT(C$16:K$16,C39:K39)","v":130},"<=",{"$f":"'Radial with IC'!C31","v":130},-700,null,"Transfer limit 1",null,{"$f":"IF(S$14,-1,1) * 'Radial with IC'!N31","v":1},{"$f":"IF(T$14,-1,1) * 'Radial with IC'!O31","v":0.5},null,null,null,null,null,null,{"$f":"SUMPRODUCT(R$16:Z$16,R39:Z39)","v":100},"<=",{"$f":"'Radial with IC'!L31","v":100},-50]
[null,"Transfer limit 2",null,null,null,null,{"$f":"IF(G$14,-1,1) * 'Radial with IC'!H32","v":1},{"$f":"IF(H$14,-1,1) * 'Radial with IC'!I32","v":0.5},null,null,null,{"$f":"SUMPRODUCT(C$16:K$16,C40:K40)","v":100},"<=",{"$f":"'Radial with IC'!C32","v":100},-1100,null,"Transfer limit 2",null,null,null,null,{"$f":"IF(V$14,-1,1) * 'Radial with IC'!Q32","v":1},{"$f":"IF(W$14,-1,1) * 'Radial with IC'!R32","v":0.2},null,null,null,{"$f":"SUMPRODUCT(R$16:Z$16,R40:Z40)","v":120},"<=",{"$f":"'Radial with IC'!L32","v":150},0]
{"$rows_left_out":623}
{"sheet":"Mesh formulation","index":10,"n_rows":144,"n_cols":48,"rows_kept":144,"cut":false,"hidden":false,"merged":[[134,2,134,19],[134,26,134,43],[121,26,121,43],[108,26,108,43],[73,26,73,43],[73,2,73,19],[108,2,108,19],[121,2,121,19],[90,2,90,7],[90,8,90,13],[90,14,90,19],[90,26,90,31],[30,2,30,7],[30,8,30,13],[30,14,30,19],[90,32,90,37],[90,38,90,43],[30,26,30,31],[30,32,30,37],[30,38,30,43],[47,26,47,43],[60,26,60,43],[60,2,60,19],[47,2,47,19]]}
[null,"ENDGAME Economics | AEMC transmission access reform | Stylised model"]
[null,"Model formulation - Mesh"]
[null,"DO NOT MODIFY"]
[null,"Powerflow Data"]
[]
[null,"Susceptance Matrix",1,2,3,4,5,6,null,"Y Bus Matrix",1,2,3,4,5,6]
[null,1,0,-10,0,0,0,0,null,1,{"$f":"IF($J7=K$6,-SUM(C$7:C$12),C7)","v":10},{"$f":"IF($J7=L$6,-SUM(D$7:D$12),D7)","v":-10},0,0,0,0]
[null,2,-10,0,-10,-10,0,0,null,2,{"$f":"IF($J8=K$6,-SUM(C$7:C$12),C8)","v":-10},30,-10,-10,0,0]
[null,3,0,-10,0,0,0,0,null,3,0,-10,10,0,0,0]
[null,4,0,-10,0,0,-10,-10,null,4,0,-10,0,30,-10,-10]
[null,5,0,0,0,-10,0,-10,null,5,0,0,0,-10,20,-10]
[null,6,0,0,0,-10,-10,0,null,6,0,0,0,-10,-10,20]
[]
[]
[null,"Flow specification","From","To","Susceptance","Theta 1","Theta 2","Theta 3","Theta 4","Theta 5","Theta 6"]
[null,"Line 1",2,1,{"$f":"VLOOKUP(C16,B$7:H$12,MATCH(D16,B$6:H$6,0),FALSE)","v":-10},-1,1,null,null,null,null,null,"Voltage Base Scalar",500]
[null,"Line 2",2,3,-10,null,1,-1]
[null,"Line 3",4,2,-10,null,-1,null,1]
[null,"Line 4",5,4,-10,null,null,null,-1,1]
[null,"Line 5",6,4,-10,null,null,null,-1,null,1]
[null,"Line 6",6,5,-10,null,null,null,null,-1,1]
[]
[]
[null,"Access Run"]
[]
[null,"Scenario 1",null,null,null,null,null,null,null,null,null,null,null,null,null,null,null,null,null,null,null,null,null,null,null,"Scenario 2"]
[]
[]
[]
[]
[null,null,"Dispatch",null,null,null,null,null,"Phase Angles",null,null,null,null,null,"USE",null,null,null,null,null,null,null,null,null,null,null,"Dispatch",null,null,null,null,null,"Phase Angles",null,null,null,null,null,"USE"]
[null,"Variable specification","Unit 1","Unit 2","Unit 3","Unit 4","Unit 5","Unit 6","Theta 1","Theta 2","Theta 3","Theta 4","Theta 5","Theta 6","USE Node 1","USE Node 2","USE Node 3","USE Node 4","USE Node 5","USE Node 6",null,null,null,null,null,"Variable specification","Unit 1","Unit 2","Unit 3","Unit 4","Unit 5","Unit 6","Theta 1","Theta 2","Theta 3","Theta 4","Theta 5","Theta 6","USE Node 1","USE Node 2","USE Node 3","USE Node 4","USE Node 5","USE Node 6"]
[null,"Cost coefficient",{"$f":"TRANSPOSE(Mesh!$F$48:$F$53)*IF(_xlfn.ANCHORARRAY(C34),-1,1)","v":60},105,50,100,-1000,-400,null,null,null,null,null,null,17500,17500,17500,17500,17500,17500,null,null,null,null,null,"Cost coefficient",{"$f":"TRANSPOSE(Mesh!$O$48:$O$53)*IF(_xlfn.ANCHORARRAY(AA34),-1,1)","v":60},100,50,150,-1000,-400,null,null,null,null,null,null,17500,17500,17500,17500,17500,17500]
[null,"Is load",{"$f":"TRANSPOSE(Mesh!$E$40:$E$45)","v":false},false,false,false,false,false,null,null,null,null,null,null,null,null,null,null,null,null,null,null,null,null,null,"Is load",{"$f":"TRANSPOSE(Mesh!$N$40:$N$45)","v":false},false,false,false,false,false]
[null,"Lowerbound",0,0,0,0,0,0,-1000,-1000,-1000,-1000,-1000,-1000,0,0,0,0,0,0,null,null,null,null,null,"Lowerbound",0,0,0,0,0,0,-1000,-1000,-1000,-1000,-1000,-1000,0,0,0,0,0,0]
[null,"Solution",200,0,200,100,200,150,-3.0000000000000002E-2,0,-0.03,2.9999999999963629E-2,9.9999999999818186E-3,2.0000000000000007E-2,0,0,0,0,0,0,null,null,null,null,null,"Solution",200,50,200,50,200,150,-3.0000000000000002E-2,0,-0.03,3.9999999999963627E-2,1.9999999999981817E-2,3.0000000000000006E-2,0,0,0,0,0,0]
[null,"Upperbound",{"$f":"TRANSPOSE(Mesh!$C$40:$C$45)","v":200},300,200,400,200,250,1000,1000,1000,1000,1000,1000,{"$f":"TRANSPOSE(Mesh!$C$23:$C$28)","v":50},150,50,400,50,150,null,null,null,null,null,"Upperbound",{"$f":"TRANSPOSE(Mesh!$L$40:$L$45)","v":200},300,200,300,200,300,1000,1000,1000,1000,1000,1000,{"$f":"TRANSPOSE(Mesh!$L$23:$L$28)","v":50},150,50,400,50,150]
[]
[]
[null,"Sense","Minimisation",null,null,null,null,null,null,null,null,null,null,null,null,null,null,null,null,null,null,null,null,null,null,"Sense","Minimisation"]
{"$rows_left_out":104}